سرزمینهای شمال غربی
preferred label: Northwest Territories @en
type: Concept
narrower: جزیره میگن

جزیره میگن
scope note: جزایر سودروپ، غرب جزیره اکسل هایبرگ در ناحیه فرانکلین.
broader: سرزمینهای شمال غربی
preferred label: Meighen Island @en
type: Concept