جزیره آدلاید
scope note: کناره ساحل غربی آنتارکتیک پنینسولا جنوب کیپ هورن
broader: قاره جنوبگان
preferred label: Adelaide Island @en
type: Concept

قاره جنوبگان
preferred label: Antarctica @en
type: Concept
narrower: جزیره آدلاید