قاره جنوبگان
preferred label: Antarctica @en
type: Concept
narrower: رشته‌کوه اوهیو

رشته‌کوه اوهیو
scope note: شمال رشته‌کوه هورلیک و جنوب ماری بیردلند
broader: قاره جنوبگان
preferred label: Ohio Range @en
type: Concept