رشته‌کوه ملکه الکساندرا
scope note: غرب جنوب سپریخی روس و شمال غرب رشته‌کوه ملکه ماد در کناره اقیانوس آرام
broader: قاره جنوبگان
preferred label: Queen Alexandra Range @en
type: Concept

قاره جنوبگان
preferred label: Antarctica @en
type: Concept
narrower: رشته‌کوه ملکه الکساندرا