سپریخی راس
preferred label: Ross Ice Shelf @en
type: Concept
related: سپر یخی مک موردو

سپر یخی مک موردو
scope note: بخشی از سپریخی راس در ناحیه مک موردو ساند در مستعمره راس در کناره اقیانوس آرام.
related: سپریخی راس
broader: قاره جنوبگان
preferred label: McMurdo Ice Shelf @en
type: Concept

قاره جنوبگان
preferred label: Antarctica @en
type: Concept
narrower: سپر یخی مک موردو