پروتاکتینیم
scope note: عنصری با عدد اتمی 91، وزن اتمی 359، دمای ذوب 1565 درجه(س)و چگالی 4/15 است
narrower: پروتاکتینیم 231
broader: آکتینید
preferred label: protactinium @en
type: Concept

پروتاکتینیم 231
preferred label: Pa-231 @en
type: Concept
broader: پروتاکتینیم

آکتینید
preferred label: actinide @en
type: Concept
narrower: پروتاکتینیم