کوریم
scope note: عنصر فلزی سه ظرفیتی دارای خاصیت رادیواکتیو با عدد اتمی 96، دمای ذوب 1340 درجه سانتیگراد، دمای جوش 3540 درجه سانتیگراد.
broader: آکتینید
preferred label: curium @en
type: Concept

آکتینید
preferred label: actinide @en
type: Concept
narrower: کوریم