آکتینید
preferred label: actinide @en
type: Concept
narrower: مندلویم

مندلویم
scope note: عنصر شیمیایی با عدد اتمی 101 رادیواکتیو مصنوعی
broader: آکتینید
preferred label: mendelevium @en
type: Concept