اربیم
scope note: عنصری با عدد اتمی 68، وزن اتمی 26/167، دمای ذوب 1522درجه سانتیگراد، دمای جوش 2510 درجه سانتیگراد و چگالی 01/9 است. که از لانتانیدهاست و برای بهبود کیفیت وانادیم و اکسید آن در شیشه سازی کاربرد دارد.
broader: خاک کمیاب
preferred label: erbium @en
type: Concept

خاک کمیاب
preferred label: rare earth @en
type: Concept
narrower: اربیم