خاک کمیاب
preferred label: rare earth @en
type: Concept
narrower: پرازئودیمیم

پرازئودیمیم
scope note: عدد اتمی 59، وزن اتمی 91/140، دمای ذوب 931 درجه (س)، دمای جوش 2/32 درجه(س)،از لانتانیدهاست
broader: خاک کمیاب
preferred label: praseodymium @en
type: Concept