لوتسیم
scope note: عنصری با عدد اتمی 71، وزن اتمی 967/174، دمای ذوب 1656 درجه سانتیگراد و جوش 3315 درجه سانتیگراد و چگالی 84/9 است. آخرین عنصر از لانتانیدهاست که ساختار فلزی بصورت شش گوشه تنگ چیده
related: نسبت لوتسیم به هافنیم
broader: خاک کمیاب
preferred label: lutetium @en
type: Concept

نسبت لوتسیم به هافنیم
preferred label: Lu/Hf @en
type: Concept
related: لوتسیم

خاک کمیاب
preferred label: rare earth @en
type: Concept
narrower: لوتسیم