گروه پلاتین
preferred label: platinum group @en
type: Concept
narrower: ایریدیم

ایریدیم
scope note: عنصری با عدد اتمی 77، وزن اتمی 22/192، دمای ذوب 2410،دمای جوش 4130، چگالی 65/22 است. از فلزهای گروه پلاتین با خواص مشابه به Rh است. ساختار این فلز مکعب تنگ‌چیده است. به عنوان ماده آلیاژی برای Pt، به صورت آلیاژ با Os برای تهیه نوک خودنویس و در کاتالیزورها به کار می‌رود.
related: کان‌سنگ ایریدیم
broader: گروه پلاتین
preferred label: iridium @en
type: Concept

کان‌سنگ ایریدیم
preferred label: iridium ore @en
type: Concept
related: ایریدیم