فشار
preferred label: pressure @en
type: Concept
narrower: فشار منفذی نابهنجار

فشار منفذی نابهنجار
scope note: فشار سیال در پوستۀ زمین که با فشار ایستایی تفاوت قابل‌ملاحظه‏ای دارد
broader: فشار
preferred label: abnormal pore pressure @en
type: Concept