فسیل شاخص
preferred label: index fossil @en
type: Concept
related: فسیل راهنما

فسیل راهنما
scope note: فسیلی که در تعیین سن طبقه‏ای که در آن یافت می‏شود، اهمیت دارد
related: فسیل شاخص
related: فسیل
preferred label: guide fossil @en
type: Concept

فسیل
preferred label: fossil @en
type: Concept
related: فسیل راهنما