فسفاتی شدن
scope note: آزاد شدن فسفرهای موجودات زنده پس از مرگ و متلاشی شدن اجساد آنها در اثر باکتریها در آب دریا را فسفاتیزاسیون یا فسفاتی شدن می گویند
related: دیاژنز
preferred label: phosphatization @en
type: Concept

دیاژنز
preferred label: diagenesis @en
type: Concept
related: فسفاتی شدن