راک بریجیت
scope note: کانی فسفاته آبدار آهن و منگنزدار که در سیستم راست‌لوزی متبلور می شود. دارای سختی 5/4 و چگالی 49/3-3/3 می‌باشد
broader: فسفات‌ها
preferred label: rockbridgeite @en
type: Concept

فسفات‌ها
preferred label: phosphate @en
type: Concept
narrower: راک بریجیت