فرسایش
preferred label: erosion @en
type: Concept
narrower: فرسایش تفریقی

فرسایش تفریقی
scope note: فرایندی که در طی آن تودۀ سنگ‌های مختلف یا بخش‌های مختلف یک سنگ با آهنگ‌های مختلف فرسایش می‏یابد
broader: فرسایش
preferred label: differential erosion @en
type: Concept