واحد زمین‌گاه‌شناختی
preferred label: geochronologic unit @en
type: Concept
narrower: دوران

دوران
scope note: واحد زمان‌زمین‌شناختی که از اَبَردوران کوچک‌تر است
narrower: زیردوران
broader: واحد زمین‌گاه‌شناختی
preferred label: era @en
type: Concept

زیردوران
preferred label: subera @en
type: Concept
broader: دوران