دوره
scope note: واحد زمین‌گاه‌شناختی که بزرگ‌تر از دور است
broader: واحد زمین‌گاه‌شناختی
preferred label: period @en
type: Concept

واحد زمین‌گاه‌شناختی
preferred label: geochronologic unit @en
type: Concept
narrower: دوره