غول‌دهانه فرسایشی
scope note: غول‌دهانه‌ای که براثر فرسایش و بازشدگی یک غول‌دهانه یا فرسایش یک مخروط آتشفشانی به وجود می‌آید
broader: غول‌دهانه
preferred label: erosion caldera @en
type: Concept

غول‌دهانه
preferred label: caldera @en
type: Concept
narrower: غول‌دهانه فرسایشی