مخروط آتشفشانی
scope note: ساختاری مخروطی که براثر خروج گدازه یا مواد آذرآواری از یک دهانه به وجود می‌آید
broader: عوارض آتشفشانی
preferred label: volcanic cone @en
type: Concept

عوارض آتشفشانی
preferred label: volcanic features @en
type: Concept
narrower: مخروط آتشفشانی