عنصر ناسازگار
scope note: عنصری که در هنگام تبلور ماگما معمولاً در مذاب باقی می‌ماند و وارد بلورهای تازه‌تشکیل‌شده نمی‌شود
related: عنصر سازگار
preferred label: incompatible element @en
type: Concept

عنصر سازگار
preferred label: compatible element @en
type: Concept
related: عنصر ناسازگار