رودخانه کانادایی
preferred label: Canadian River @en
type: Concept
related: نهر یوته

نهر یوته
scope note: به داخل رود کانادایی در شمال شرق نیومکزیکو جریان می‌یابد
related: رودخانه کانادایی
related: نیومکزیکو
preferred label: Ute Creek @en
type: Concept

نیومکزیکو
preferred label: New Mexico @en
type: Concept
related: نهر یوته