صفحه دوقلویی
scope note: صفحۀ مشترکی که در امتداد آن بلورهای منفرد در یک بلور دوقلو آرایش متقارن دارند
related: دوقلوزایی
preferred label: twinning plane @en
type: Concept

دوقلوزایی
preferred label: twinning @en
type: Concept
related: صفحه دوقلویی