شکستگی هیدرولیکی
preferred label: hydraulic fracturing @en
type: Concept
related: شکستگی(هیدرولیکی)

شکستگی(هیدرولیکی)
scope note: این واژه جهت شکستگی‌های طبیعی استفاده می‌شود و برای شکستگی که مصنوعی ایجاد شده باشد استفاده نمی‌شود.
related: عنصر شکسته شده
related: شکستگی هیدرولیکی
preferred label: fracturing @en
type: Concept

عنصر شکسته شده
preferred label: fractured material @en
type: Concept
related: شکستگی(هیدرولیکی)