درزه
preferred label: joint @en
type: Concept
narrower: درزه قطری

درزه قطری
scope note: درزه‏ای که امتداد آن نسبت به امتداد چین‌های رسوبی یا رَخ سنگ مایل است
broader: درزه
preferred label: diagonal joint @en
type: Concept