درزه
preferred label: joint @en
type: Concept
narrower: درزه منشوری

لایه‌بندی
preferred label: bedding @en
type: Concept
related: درزه منشوری

درزه منشوری
alternative label: درزه ستونی
scope note: مجموعه‏ای از درزه‏های موازی و منشوری و چندضلعی در برخی سنگ‌های آتشفشانی که براثر سرد شدن به وجود می‌آیند
related: لایه‌بندی
broader: درزه
preferred label: columnar joint @en
type: Concept