شکستگی
preferred label: fracture(structural geology) @en
type: Concept
narrower: شکستگی برشی

شکستگی برشی
scope note: نوعی شکستگی ناشی از تنش‌هایی که باعث برش یک قسمت از سنگ می‌شود
broader: شکستگی
preferred label: shear fracture @en
type: Concept