شکستگی حلقوی
scope note: شکستگی‌های پرشیب که ظاهری استوانه‏ای دارند
broader: شکستگی
preferred label: ring fracture @en
type: Concept

شکستگی
preferred label: fracture(structural geology) @en
type: Concept
narrower: شکستگی حلقوی