شکست صدفی
scope note: شکستی در یک کانی که سطح آن تحدب یا تقعر صدفی دارد
broader: شکست(کانی‌شناسی)
preferred label: conchoidal fracture @en
type: Concept

شکست(کانی‌شناسی)
preferred label: fracture(mineralogy) @en
type: Concept
narrower: شکست صدفی