شکافه‏پرکن
scope note: سیال حاوی مواد معدنی که درزه و شکستگی سنگ‌ها را پر می‌کند و رگۀ معدنی به وجود می‌آورد
related: شکافه‏دار
related: شکافه
preferred label: fissure filling @en
type: Concept

شکافه‏دار
preferred label: fissured @en
type: Concept
related: شکافه‏پرکن

شکافه
preferred label: fissure @en
type: Concept
related: شکافه‏پرکن