شاخص فاصله‏بندی شکستگی
scope note: شاخصی برای رابطۀ میان ضخامت لایه و فاصله‏بندی شکستگی
related: شکستگی
preferred label: fracture spacing index ( FSI) @en
type: Concept

شکستگی
preferred label: fracture(structural geology) @en
type: Concept
related: شاخص فاصله‏بندی شکستگی