پارگازیت
scope note: کلینوآمفیبول، دارای سیستم تبلور منوکلینیک، درجه سختی 5/5 و چگالی 5/3-3 است. نوع سبز رنگ هورنبلند که در سنگهای حاصل از دگرگونی همبری یافت می شود
broader: کلینوآمفیبول
preferred label: pargasite @en
type: Concept

کلینوآمفیبول
preferred label: clinoamphibole @en
type: Concept
narrower: پارگازیت