تشرماکیت
scope note: کانی سیلیکاته کلینوآمفیبول از گروه آمفیبولها
broader: کلینوآمفیبول
preferred label: tschermakite @en
type: Concept

کلینوآمفیبول
preferred label: clinoamphibole @en
type: Concept
narrower: تشرماکیت