گلوکوفان
preferred label: glaucophane @en
type: Concept
related: کروسیت

کروسیت
scope note: نوعی آمفیبول آبی که حدواسط کانی ریبکیت و گلوکوفان می باشد.
related: گلوکوفان
broader: کلینوآمفیبول
preferred label: crossite @en
type: Concept

کلینوآمفیبول
preferred label: clinoamphibole @en
type: Concept
narrower: کروسیت