کلینوپیروکسن
preferred label: clinopyroxene @en
type: Concept
narrower: اومفاسیت

اومفاسیت
scope note: دارای سیستم تبلور مونوکلینیک، سختی 6-5، چگالی 37/3-29/3. توده سبز رنگی که در اثر تجزیه سنگهای آذرین قلیایی ایجاد می‌گردد
related: اوژیت
broader: کلینوپیروکسن
preferred label: omphacite @en
type: Concept

اوژیت
preferred label: augite @en
type: Concept
related: اومفاسیت