سیستم سه‌شیبی
alternative label: سیستم تری‌کلینیک
scope note: یکی از شش سیستم بلوری که با یک محور تقارن و سه محور با طول و زاویه‌های نابرابر مشخص می‌شود
related: بلورنگاری
broader: سیستم بلوری
preferred label: triclinic system @en
type: Concept

بلورنگاری
preferred label: crystallography @en
type: Concept
related: سیستم سه‌شیبی

سیستم بلوری
preferred label: crystal system @en
type: Concept
narrower: سیستم سه‌شیبی