سیارک نوع اس
preferred label: S-type asteroid @en
type: Concept
narrower: سیارک آیدا

سیارک آیدا
scope note: موضوع مشاهدات فضاپیمای کم‌ارتفاع گالیله.
broader: سیارک نوع اس
preferred label: Ida Asteroid @en
type: Concept