کیسریت
scope note: سولفات آبدار منیزیم که به عنوان کود مورد بهره‌گیری قرار می‌گیرد.
broader: سولفات‌ها
preferred label: kieserite @en
type: Concept

سولفات‌ها
preferred label: sulfate @en
type: Concept
narrower: کیسریت