هیدروکربن‌ها
preferred label: hydrocarbon @en
type: Concept
related: سوخت فسیلی

سوخت فسیلی
scope note: هیدروکربن‌ها یا سنگ‌های کربن‏داری که می‏توان از آنها به‌عنوان سوخت استفاده کرد
related: هیدروکربن‌ها
preferred label: fossil fuel @en
type: Concept