پریابونین
preferred label: Priabonian @en
type: Concept
related: لودین

ائوسن فوقانی
preferred label: upper Eocene @en
type: Concept
narrower: لودین

لودین
scope note: اروپا. بالای بارتونین، زیر تونگرین (اولیگوسن)
related: پریابونین
broader: ائوسن فوقانی
preferred label: Ludian @en
type: Concept