پُوِرکان
scope note: اشکوب قاره‌ای آمریکای شمالی. بالای کرتاسه و زیر دراگونین
broader: پالئوسن زیرین
preferred label: Puercan @en
type: Concept

پالئوسن زیرین
preferred label: lower Paleocene @en
type: Concept
narrower: پُوِرکان