پالئوسن زیرین
preferred label: lower Paleocene @en
type: Concept
narrower: تورجونین

تورجونین
scope note: آمریکای شمالی، پالئوسن زیرین، بالای دراگونین و زیر تیفانین
broader: پالئوسن زیرین
preferred label: Torrejonian @en
type: Concept