تیفانین
scope note: آمریکای شمالی، پالئوسن بالایی، بالای تورنژین و زیر کلارک فورکین
broader: پالئوسن زیرین
preferred label: Tiffanian @en
type: Concept

پالئوسن زیرین
preferred label: lower Paleocene @en
type: Concept
narrower: تیفانین