نقشه
preferred label: map @en
type: Concept
narrower: نقشه زیست‏رخساره

نقشه زیست‏رخساره
scope note: نقشۀ رخساره براساس خصوصیات دیرینه‏شناختی که نشان‏دهندۀ تغییرات محیطی و خصوصیات کلی یک واحد چینه‏شناختی است
broader: نقشه
preferred label: biofacies map @en
type: Concept