ایروینگتونین
scope note: آمریکای شمالی. بالای بلنکن و زیر رنچولابرین. اشکوب قاره‌ای.
broader: پلیستوسن
preferred label: Irvingtonian @en
type: Concept

پلیستوسن
preferred label: Pleistocene @en
type: Concept
narrower: ایروینگتونین