پلیستوسن زیرین
preferred label: lower Pleistocene @en
type: Concept
narrower: آفتونین

آفتونین
scope note: مدت زمان فاصله بین دوره های یخچالی در شمال آمریکا
broader: پلیستوسن زیرین
preferred label: Aftonian @en
type: Concept