کانزان
scope note: آمریکای شمالی. وابسته به دومین عصر یخچالی پلیستوسن.
broader: پلیستوسن زیرین
preferred label: Kansan @en
type: Concept

پلیستوسن زیرین
preferred label: lower Pleistocene @en
type: Concept
narrower: کانزان