پلیستوسن فوقانی
preferred label: upper Pleistocene @en
type: Concept
narrower: تیرنین

تیرنین
scope note: اروپا. پلیستوسن بالایی. بالای میلازین، زیر ورسیلین
broader: پلیستوسن فوقانی
preferred label: Tyrrhenian @en
type: Concept