میان دوره یخچالی ریس-وُرم
preferred label: Riss/Wurm Interglacial @en
type: Concept
related: سنگامونین

سنگامونین
scope note: مربوط به سومین اشکوب میانی یخچالی از عصر پلیستوسن در آمریکای شمالی
related: میان دوره یخچالی ریس-وُرم
broader: پلیستوسن فوقانی
preferred label: Sangamonian @en
type: Concept

پلیستوسن فوقانی
preferred label: upper Pleistocene @en
type: Concept
narrower: سنگامونین